Coahuila and Texas, Mexico
type: Concept
member of: lcnaf
member of: viaf
in scheme: scheme
alternative label: Coahuila y Tejas @es
broader: Mexico
change note:
  comment: initial version
  created: 2019-01-10T13:10:34-06:00
  creator: Diana Dulek
change note:
  comment: Added broader term "Mexico." Removed related term "North and Central America." Added term to Library of Congress Name Authority File and Virtual International Authority File collections. Added altLabel "Coahuila y Tejas."
  creator: Laura Ramirez
  modified: 2022-09-13T11:25:42-05:00
change note:
  comment: Updated prefLabel from "Coahuila and Texas" to "Coahuila and Texas, Mexico."
  creator: Laura Ramirez
  modified: 2022-09-15T11:52:46-05:00
definition: See Handbook of Texas Online entry (accessed 2019-01-10): https://tshaonline.org/handbook/online/articles/usc01