Antebellum Texas, 1846-1861
type: Concept
in scheme: scheme
broader: Time Period
change note:
  comment: initial version
  created: 2022-09-13T12:03:00-05:00
  creator: Laura Ramirez
definition: See Handbook of Texas Online entry (accessed 2022-09-13): https://www.tshaonline.org/handbook/entries/antebellum-texas