Household waste
type: Concept
member of: lcsh
in scheme: scheme
alternative label: Garbage
broader: Concept
change note:
  comment: initial version
  created: 2024-05-07T12:08:06-05:00
  creator: Susan Hoover
scope note: Use for household waste such as food scraps and kitchen grease. For unwanted materials that are disposed of improperly, e.g. paper dropped on the ground or thrown out of a car window, see Litter (Trash).