McMillan, J. J.
type: Concept
in scheme: scheme
broader: Person
change note:
  comment: initial version
  created: 2019-11-21T12:22:55-06:00
  creator: Christin Zepeda
definition: Source: Mary (Mrs. Anson) Jones Letters.