Eagle, Joe H.
type: Concept
in scheme: scheme
broader: Person
change note:
  comment: initial version
  created: 2022-09-09T09:56:08-05:00
  creator: Christin Zepeda
definition: See Handbook of Texas Online entry (accessed 2022-09-09): https://www.tshaonline.org/handbook/entries/eagle-joe-henry
editorial note: Source: Joseph S. Cullinan Papers.