First Mexican Republic, 1822-1846
type: Concept
in scheme: scheme
broader: Time Period
change note:
  comment: initial version
  created: 2022-09-13T16:15:49-05:00
  creator: Laura Ramirez
definition: See National Parks Service entry (accessed 2022-09-13): https://www.nps.gov/prsf/learn/historyculture/mexican-period.htm#:~:text=In%201810%2C%20growing%20dissatisfaction%20with,formation%20of%20the%20Mexican%20Republic