Idar, Clemente N.
type: Concept
in scheme: scheme
broader: Person
change note:
  comment: initial version
  created: 2022-01-19T12:27:47-06:00
  creator: Laura Ramirez
definition: See Handbook of Texas Online entry (accessed 2022-01-19): https://www.tshaonline.org/handbook/entries/idar-clemente-nicasio
editorial note: Source: Alonso S. Perales Papers.