Lefevre, Arthur
type: Concept
member of: lcnaf
member of: viaf
in scheme: scheme
broader: Person
change note:
  comment: initial version
  created: 2020-07-10T12:03:25-05:00
  creator: Laura Ramirez
definition: See Handbook of Texas Online entry (accessed 2020-07-10): http://www.tshaonline.org/handbook/online/articles/fle21
editorial note: Source: Texaco Star.