Wells, Pauline J.
type: Concept
in scheme: scheme
alternative label: Wells, James B., Mrs.
broader: Person
change note:
  comment: initial version
  created: 2020-09-29T15:48:59-05:00
  creator: Christin Zepeda
definition: See Handbook of Texas Online entry (accessed 2020-09-30): https://www.tshaonline.org/handbook/entries/wells-pauline-josefine-kleiber
editorial note: Source: Minnie Fisher Cunningham Papers.