Pyle, Owen P.
type: Concept
in scheme: scheme
broader: Person
change note:
  comment: initial version
  created: 2024-06-18T16:00:14-05:00
  creator: Laura Ramirez
definition: See Handbook of Texas Online entry (accessed 2024-06-18): https://www.tshaonline.org/handbook/entries/pyle-owen-pinkney
editorial note: Source: National Co-Operator and Farm Journal.