Tres Palacios, Texas
type: Concept
in scheme: scheme
broader: Matagorda County, Texas
change note:
  comment: initial version
  created: 2019-01-08T10:42:50-06:00
  creator: Diana Dulek
definition: See Handbook of Texas Online entry (accessed 2019-01-08): https://tshaonline.org/handbook/online/articles/hrt66