Brackenridge, Mary E.
type: Concept
in scheme: scheme
broader: Person
change note:
  comment: initial version
  created: 2020-09-22T16:13:57-05:00
  creator: Christin Zepeda
definition: See Handbook of Texas Online entry (accessed 2020-22-09): https://www.tshaonline.org/handbook/entries/brackenridge-mary-eleanor
editorial note: Source: Minnie Fisher Cunningham Papers.