Thomson, Thaddeus A.
type: Concept
in scheme: scheme
broader: Person
change note:
  comment: initial version
  created: 2019-08-01T14:52:01-05:00
  creator: Christin Zepeda
definition: See Handbook of Texas Online entry (accessed 2019-08-01): https://tshaonline.org/handbook/online/articles/fth31
editorial note: Source: Cruiser Houston Collection.