Fort Merrill
type: Concept
in scheme: scheme
broader: Concept
related: Nueces River
change note:
  comment: initial version
  created: 2019-01-04T11:36:12-06:00
  creator: Diana Dulek
definition: See Handbook of Texas Online entry (accessed 2019-01-04): https://tshaonline.org/handbook/online/articles/qbf37