Fisher, Sallie C.
type: Concept
in scheme: scheme
broader: Person
change note:
  comment: initial version
  created: 2020-09-29T16:35:16-05:00
  creator: Laura Ramirez
definition: See Handbook of Texas Online entry (accessed 2020-09-29): https://www.tshaonline.org/handbook/entries/cunningham-minnie-fisher
editorial note: Source: Minnie Fisher Cunningham Papers.