Gearing, Mary E.
type: Concept
in scheme: scheme
broader: Person
change note:
  comment: initial version
  created: 2020-09-23T14:33:45-05:00
  creator: Laura Ramirez
definition: See Handbook of Texas Online entry (accessed 2020-23-09): https://www.tshaonline.org/handbook/entries/gearing-mary-edna
editorial note: Source: Minnie Fisher Cunningham Papers.