Quin, Charles Kennon
type: Concept
in scheme: scheme
broader: Person
change note:
  comment: initial version
  created: 2022-01-19T14:31:31-06:00
  creator: Laura Ramirez
definition: See Handbook of Texas Online entry (accessed 2022-01-19): https://www.tshaonline.org/handbook/entries/quin-charles-kennon
editorial note: Source: Alonso S. Perales Papers.