Del Valle, Santiago
type: Concept
in scheme: scheme
broader: Person
change note:
  comment: initial version
  created: 2021-07-23T12:29:02-05:00
  creator: Laura Ramirez
definition: See Handbook of Texas Online entry (accessed 2021-07-15): https://www.tshaonline.org/handbook/entries/del-valle-santiago
editorial note: Source: Mexico Documents Collection.