Richardson, Alfred S.
type: Concept
in scheme: scheme
broader: Person
change note:
  comment: initial version
  created: 2019-01-18T13:20:24-06:00
  creator: Christin Zepeda
definition: See Handbook of Texas Online entry (accessed 2019-01-18): https://tshaonline.org/handbook/online/articles/fri60
editorial note: Source: George Fuermann "Texas and Houston" Collection.